Reaction Details
TargetEndothelin-1 receptor
LigandBDBM50079419
Substrate/Competitorn/a
Meas. Tech.ChEMBL_65646 (CHEMBL678558)
Ki 32±n/a nM
Citation Amberg, WHergenröder, SHillen, HJansen, RKettschau, GKling, AKlinge, DRaschack, MRiechers, HUnger, L Discovery and synthesis of (S)-3-[2-(3,4-dimethoxyphenyl)ethoxy]-2- (4,6-dimethylpyrimidin-2-yloxy)-3,3-diphenylpropionic acid (LU 302872), a novel orally active mixed ET(A)/ET(B) receptor antagonist. J Med Chem42:3026-32 (1999) 
 
Endothelin-1 receptor
Name:Endothelin-1 receptor
Type:Enzyme Catalytic Domain
Mol. Mass.:48736.88
Organism:Homo sapiens (Human)
Description:P25101
Residue:427
BDBM50079419
NameBDBM50079419
Synonyms:2-(4,6-Dimethyl-pyrimidin-2-yloxy)-3,3-diphenyl-3-((E)-3-p-tolyl-allyloxy)-propionic acid | CHEMBL321984
TypeSmall organic molecule
Emp. Form.C31H30N2O4
Mol. Mass.494.5809
SMILESCc1ccc(\C=C\COC(C(Oc2nc(C)cc(C)n2)C(O)=O)(c2ccccc2)c2ccccc2)cc1