Reaction Details
TargetEndothelin receptor type B
LigandBDBM50079437
Substrate/Competitorn/a
Meas. Tech.ChEMBL_63846 (CHEMBL673230)
Ki 215±n/a nM
Citation Amberg, WHergenröder, SHillen, HJansen, RKettschau, GKling, AKlinge, DRaschack, MRiechers, HUnger, L Discovery and synthesis of (S)-3-[2-(3,4-dimethoxyphenyl)ethoxy]-2- (4,6-dimethylpyrimidin-2-yloxy)-3,3-diphenylpropionic acid (LU 302872), a novel orally active mixed ET(A)/ET(B) receptor antagonist. J Med Chem42:3026-32 (1999) 
 
Endothelin receptor type B
Name:Endothelin receptor type B
Type:Enzyme Catalytic Domain
Mol. Mass.:49664.00
Organism:Homo sapiens (Human)
Description:ENDOTHELIN B EDNRB HUMAN::P24530
Residue:442
BDBM50079437
NameBDBM50079437
Synonyms:3,3-Bis-(4-chloro-phenyl)-3-[2-(3,4-dimethoxy-phenyl)-ethoxy]-2-(4-methoxy-6,7-dihydro-5H-cyclopentapyrimidin-2-yloxy)-propionic acid | CHEMBL103605
TypeSmall organic molecule
Emp. Form.C33H32Cl2N2O7
Mol. Mass.639.522
SMILESCOc1ccc(CCOC(C(Oc2nc3CCCc3c(OC)n2)C(O)=O)(c2ccc(Cl)cc2)c2ccc(Cl)cc2)cc1OC