Reaction Details
TargetEndothelin receptor type B
LigandBDBM50079421
Substrate/Competitorn/a
Meas. Tech.ChEMBL_63846 (CHEMBL673230)
Ki 170±n/a nM
Citation Amberg, WHergenröder, SHillen, HJansen, RKettschau, GKling, AKlinge, DRaschack, MRiechers, HUnger, L Discovery and synthesis of (S)-3-[2-(3,4-dimethoxyphenyl)ethoxy]-2- (4,6-dimethylpyrimidin-2-yloxy)-3,3-diphenylpropionic acid (LU 302872), a novel orally active mixed ET(A)/ET(B) receptor antagonist. J Med Chem42:3026-32 (1999) 
 
Endothelin receptor type B
Name:Endothelin receptor type B
Type:Enzyme Catalytic Domain
Mol. Mass.:49664.00
Organism:Homo sapiens (Human)
Description:ENDOTHELIN B EDNRB HUMAN::P24530
Residue:442
BDBM50079421
NameBDBM50079421
Synonyms:2-(4,6-Dimethyl-pyrimidin-2-yloxy)-3,3-diphenyl-3-(3-p-tolyl-propoxy)-propionic acid | CHEMBL103190
TypeSmall organic molecule
Emp. Form.C31H32N2O4
Mol. Mass.496.5968
SMILESCc1ccc(CCCOC(C(Oc2nc(C)cc(C)n2)C(O)=O)(c2ccccc2)c2ccccc2)cc1