Reaction Details
TargetEndothelin-1 receptor
LigandBDBM50079434
Substrate/Competitorn/a
Meas. Tech.ChEMBL_65646 (CHEMBL678558)
Ki 250±n/a nM
Citation Amberg, WHergenröder, SHillen, HJansen, RKettschau, GKling, AKlinge, DRaschack, MRiechers, HUnger, L Discovery and synthesis of (S)-3-[2-(3,4-dimethoxyphenyl)ethoxy]-2- (4,6-dimethylpyrimidin-2-yloxy)-3,3-diphenylpropionic acid (LU 302872), a novel orally active mixed ET(A)/ET(B) receptor antagonist. J Med Chem42:3026-32 (1999) 
 
Endothelin-1 receptor
Name:Endothelin-1 receptor
Type:Enzyme Catalytic Domain
Mol. Mass.:48736.88
Organism:Homo sapiens (Human)
Description:P25101
Residue:427
BDBM50079434
NameBDBM50079434
Synonyms:2-(4,6-Dimethyl-pyrimidin-2-yloxy)-3,3-bis-(4-ethyl-phenyl)-3-[2-(4-methoxy-phenyl)-ethoxy]-propionic acid | CHEMBL317716
TypeSmall organic molecule
Emp. Form.C34H38N2O5
Mol. Mass.554.6759
SMILESCCc1ccc(cc1)C(OCCc1ccc(OC)cc1)(C(Oc1nc(C)cc(C)n1)C(O)=O)c1ccc(CC)cc1