Reaction Details
TargetEndothelin receptor type B
LigandBDBM50079429
Substrate/Competitorn/a
Meas. Tech.ChEMBL_63846 (CHEMBL673230)
Ki 14.7±n/a nM
Citation Amberg, WHergenröder, SHillen, HJansen, RKettschau, GKling, AKlinge, DRaschack, MRiechers, HUnger, L Discovery and synthesis of (S)-3-[2-(3,4-dimethoxyphenyl)ethoxy]-2- (4,6-dimethylpyrimidin-2-yloxy)-3,3-diphenylpropionic acid (LU 302872), a novel orally active mixed ET(A)/ET(B) receptor antagonist. J Med Chem42:3026-32 (1999) 
 
Endothelin receptor type B
Name:Endothelin receptor type B
Type:Enzyme Catalytic Domain
Mol. Mass.:49664.00
Organism:Homo sapiens (Human)
Description:ENDOTHELIN B EDNRB HUMAN::P24530
Residue:442
BDBM50079429
NameBDBM50079429
Synonyms:3-[2-(3,4-Dimethoxy-phenyl)-ethoxy]-2-(4-methoxy-6-methyl-pyrimidin-2-yloxy)-3,3-diphenyl-propionic acid | CHEMBL319031
TypeSmall organic molecule
Emp. Form.C31H32N2O7
Mol. Mass.544.595
SMILESCOc1cc(C)nc(OC(C(O)=O)C(OCCc2ccc(OC)c(OC)c2)(c2ccccc2)c2ccccc2)n1