Reaction Details
TargetEndothelin-1 receptor
LigandBDBM50079425
Substrate/Competitorn/a
Meas. Tech.ChEMBL_65646 (CHEMBL678558)
Ki 25±n/a nM
Citation Amberg, WHergenröder, SHillen, HJansen, RKettschau, GKling, AKlinge, DRaschack, MRiechers, HUnger, L Discovery and synthesis of (S)-3-[2-(3,4-dimethoxyphenyl)ethoxy]-2- (4,6-dimethylpyrimidin-2-yloxy)-3,3-diphenylpropionic acid (LU 302872), a novel orally active mixed ET(A)/ET(B) receptor antagonist. J Med Chem42:3026-32 (1999) 
 
Endothelin-1 receptor
Name:Endothelin-1 receptor
Type:Enzyme Catalytic Domain
Mol. Mass.:48736.88
Organism:Homo sapiens (Human)
Description:P25101
Residue:427
BDBM50079425
NameBDBM50079425
Synonyms:2-(4,6-Dimethyl-pyrimidin-2-yloxy)-3-phenethyloxy-3,3-diphenyl-propionic acid | CHEMBL317233
TypeSmall organic molecule
Emp. Form.C29H28N2O4
Mol. Mass.468.5436
SMILESCc1cc(C)nc(OC(C(O)=O)C(OCCc2ccccc2)(c2ccccc2)c2ccccc2)n1