Reaction Details
TargetAdenosine receptor A2a
LigandBDBM50034683
Substrate/Competitorn/a
Meas. Tech.ChEMBL_30011 (CHEMBL641302)
Ki>100000±n/a nM
Citation Jiang, JLi, AHJang, SYChang, LMelman, NMoro, SJi, XLobkovsky, EBClardy, JCJacobson, KA Chiral resolution and stereospecificity of 6-phenyl-4-phenylethynyl- 1,4-dihydropyridines as selective A(3) adenosine receptor antagonists. J Med Chem42:3055-65 (1999) 
 
Adenosine receptor A2a
Name:Adenosine receptor A2a
Type:G Protein-Coupled Receptor (GPCR)
Mol. Mass.:45015.65
Organism:Rattus norvegicus (rat)
Description:Rat A2A receptors expressed in CHO cells.
Residue:410
BDBM50034683
NameBDBM50034683
Synonyms:(S)-2,6-Dimethyl-4-(3-nitro-phenyl)-1,4-dihydro-pyridine-3,5-dicarboxylic acid 3-[3-(4,4-diphenyl-piperidin-1-yl)-propyl] ester 5-methyl ester | CHEMBL41929
TypeSmall organic molecule
Emp. Form.C36H39N3O6
Mol. Mass.609.7114
SMILESCOC(=[OH+])C1=C(C)N=C(C)C([C@H]1c1cccc(c1)[N+]([O-])=O)=C([O-])OCCCN1CCC(CC1)(c1ccccc1)c1ccccc1