Reaction Details
TargetAdenosine receptor A1
LigandBDBM50079451
Substrate/Competitorn/a
Meas. Tech.ChEMBL_29465 (CHEMBL642194)
Ki 32000±n/a nM
Citation Jiang, JLi, AHJang, SYChang, LMelman, NMoro, SJi, XLobkovsky, EBClardy, JCJacobson, KA Chiral resolution and stereospecificity of 6-phenyl-4-phenylethynyl- 1,4-dihydropyridines as selective A(3) adenosine receptor antagonists. J Med Chem42:3055-65 (1999) 
 
Adenosine receptor A1
Name:Adenosine receptor A1
Type:Protein
Mol. Mass.:36704.13
Organism:Rattus norvegicus (rat)
Description:n/a
Residue:326
BDBM50079451
NameBDBM50079451
Synonyms:(S)-2-Methyl-6-phenyl-4-phenylethynyl-1,4-dihydro-pyridine-3,5-dicarboxylic acid 3-((R)-2,2-dimethyl-[1,3]dioxolan-4-ylmethyl) ester 5-ethyl ester | CHEMBL104198
TypeSmall organic molecule
Emp. Form.C30H31NO6
Mol. Mass.501.5702
SMILESCCOC(=O)C1=C(N=C(C)C([C@@H]1C#Cc1ccccc1)C(=O)OC[C@H]1COC(C)(C)O1)c1ccccc1