Reaction Details
TargetAdenosine receptor A3
LigandBDBM50079448
Substrate/Competitorn/a
Meas. Tech.ChEMBL_31991 (CHEMBL646439)
Ki 426.0±n/a nM
Citation Jiang, JLi, AHJang, SYChang, LMelman, NMoro, SJi, XLobkovsky, EBClardy, JCJacobson, KA Chiral resolution and stereospecificity of 6-phenyl-4-phenylethynyl- 1,4-dihydropyridines as selective A(3) adenosine receptor antagonists. J Med Chem42:3055-65 (1999) 
 
Adenosine receptor A3
Name:Adenosine receptor A3
Type:G Protein-Coupled Receptor (GPCR)
Mol. Mass.:36197.32
Organism:Homo sapiens (Human)
Description:P0DMS8
Residue:318
BDBM50079448
NameBDBM50079448
Synonyms:(R)-2-Methyl-6-phenyl-4-phenylethynyl-1,4-dihydro-pyridine-3,5-dicarboxylic acid 3-((R)-2,2-dimethyl-[1,3]dioxolan-4-ylmethyl) ester 5-ethyl ester | CHEMBL431232
TypeSmall organic molecule
Emp. Form.C30H31NO6
Mol. Mass.501.5702
SMILESCCOC(=O)C1=C(N=C(C)C([C@H]1C#Cc1ccccc1)C(=O)OC[C@H]1COC(C)(C)O1)c1ccccc1