Reaction Details
TargetNeuronal acetylcholine receptor subunit alpha-4/beta-2
LigandBDBM50079453
Substrate/Competitorn/a
Meas. Tech.ChEMBL_143879 (CHEMBL751862)
Ki 0.26±n/a nM
Citation Schmitt, JDSharples, CGCaldwell, WS Molecular recognition in nicotinic acetylcholine receptors: the importance of pi-cation interactions. J Med Chem42:3066-74 (1999) 
 
Neuronal acetylcholine receptor subunit alpha-4/beta-2
Name:Neuronal acetylcholine receptor subunit alpha-4/beta-2
Type:Protein
Mol. Mass.:n/a
Description:n/a
Components:This complex has 2 components.
Component 1
Name:Neuronal acetylcholine receptor subunit alpha-4
Synonyms:ACHA4_HUMAN CHRNA4 protein Neuronal acetylcholine receptor protein alpha-4 subunit Nicotinic acetylcholine receptor alpha4/beta2/alpha5
Type:n/a
Mol. Mass.:69963.49
Organism:Homo sapiens (Human)
Description:NACHRA4
Residue:627
Component 2
Name:Neuronal acetylcholine receptor subunit beta-2
Synonyms:ACHB2_HUMAN Neuronal acetylcholine receptor protein beta-2 subunit | Nicotinic acetylcholine receptor alpha3/beta2/alpha5
Type:Protein
Mol. Mass.:57020.50
Organism:Homo sapiens (Human)
Description:P17787
Residue:502
BDBM50079453
NameBDBM50079453
Synonyms:2-(6-Chloro-pyridin-3-yl)-7-methyl-7-aza-bicyclo[2.2.1]heptane CMI-489 | N-methylepibatidine
TypeSmall organic molecule
Emp. Form.C12H15ClN2
Mol. Mass.222.714
SMILESCN1C2CCC1C(C2)c1ccc(Cl)nc1