Reaction Details
TargetVoltage-dependent L-type calcium channel subunit alpha-1C
LigandBDBM50079463
Substrate/Competitorn/a
Meas. Tech.ChEMBL_214942 (CHEMBL819393)
Ki 5.6±n/a nM
Citation Natale, NRRogers, MEStaples, RTriggle, DJRutledge, A Lipophilic 4-isoxazolyl-1,4-dihydropyridines: synthesis and structure-activity relationships. J Med Chem42:3087-93 (1999) 
 
Voltage-dependent L-type calcium channel subunit alpha-1C
Name:Voltage-dependent L-type calcium channel subunit alpha-1C
Type:Enzyme Catalytic Domain
Mol. Mass.:243492.26
Organism:RAT
Description:Calcium channel 0 RAT::P22002
Residue:2169
BDBM50079463
NameBDBM50079463
Synonyms:4-{5-[2-(3-Bromo-phenyl)-ethyl]-3-phenyl-isoxazol-4-yl}-2,6-dimethyl-1,4-dihydro-pyridine-3,5-dicarboxylic acid diethyl ester | CHEMBL325811
TypeSmall organic molecule
Emp. Form.C30H31BrN2O5
Mol. Mass.579.482
SMILESCCOC(=O)C1C(c2c(CCc3cccc(Br)c3)onc2-c2ccccc2)C(C(=O)OCC)=C(C)N=C1C