Reaction Details
TargetVoltage-dependent L-type calcium channel subunit alpha-1C
LigandBDBM50079464
Substrate/Competitorn/a
Meas. Tech.ChEMBL_214942 (CHEMBL819393)
Ki 11±n/a nM
Citation Natale, NRRogers, MEStaples, RTriggle, DJRutledge, A Lipophilic 4-isoxazolyl-1,4-dihydropyridines: synthesis and structure-activity relationships. J Med Chem42:3087-93 (1999) 
 
Voltage-dependent L-type calcium channel subunit alpha-1C
Name:Voltage-dependent L-type calcium channel subunit alpha-1C
Type:Enzyme Catalytic Domain
Mol. Mass.:243492.26
Organism:RAT
Description:Calcium channel 0 RAT::P22002
Residue:2169
BDBM50079464
NameBDBM50079464
Synonyms:2,6-Dimethyl-4-[3-methyl-5-(2-naphthalen-2-yl-ethyl)-isoxazol-4-yl]-1,4-dihydro-pyridine-3,5-dicarboxylic acid diethyl ester | CHEMBL317651
TypeSmall organic molecule
Emp. Form.C29H32N2O5
Mol. Mass.488.5748
SMILESCCOC(=O)C1C(c2c(C)noc2CCc2ccc3ccccc3c2)C(C(=O)OCC)=C(C)N=C1C