Reaction Details
TargetPeptidyl-prolyl cis-trans isomerase FKBP1A
LigandBDBM50079765
Substrate/Competitorn/a
Meas. Tech.ChEBML_66268
EC50 5.3±n/a nM
Citation Goulet, MTSinclair, PJWong, FStaruch, MJDumont, FJCryan, JGWiederrecht, GJWyvratt, MJParsons, WH C32-O-phenalkyl ether derivatives of the immunosuppressant ascomycin: a tether length study. Bioorg Med Chem Lett9:2085-8 (1999) Peptidyl-prolyl cis-trans isomerase FKBP1A
Name:Peptidyl-prolyl cis-trans isomerase FKBP1A
Type:Isomerase
Mol. Mass.:11953.09
Organism:Homo sapiens (Human)
Description:P62942
Residue:108
BDBM50079765
NameBDBM50079765
Synonyms:C32-O-Phenalkyl ether derivative of Ascomycin CHEMBL293155
TypeSmall organic molecule
Emp. Form.C50H75NO12
Mol. Mass.882.13
SMILESCC[C@@H]1\C=C(C)\C[C@H](C)C[C@H](OC)[C@H]2O[C@](O)([C@H](C)C[C@@H]2OC)C(=O)C(=O)N2CCCC[C@H]2C(=O)O[C@@H]([C@H](C)[C@@H](O)CC1=O)C(\C)=C\[C@@H]1CC[C@@H](OCc2ccccc2)[C@@H](C1)OC