Reaction Details
TargetProtein phosphatase 3 catalytic subunit alpha
LigandBDBM50079781
Substrate/Competitorn/a
Meas. Tech.ChEBML_42586
IC50 8.7±n/a nM
Citation Armstrong, HMWong, FHolmes, MASinclair, PJGoulet, MTDumont, FJStaruch, MJKoprak, SPeterson, LBRosa, RWilusz, MBWiederrecht, GJCryan, JGWyvratt, MJParsons, WH Potent immunosuppressive C32-O-arylethyl ether derivatives of ascomycin with reduced toxicity. Bioorg Med Chem Lett9:2089-94 (1999) Protein phosphatase 3 catalytic subunit alpha
Name:Protein phosphatase 3 catalytic subunit alpha
Type:Enzyme Catalytic Domain
Mol. Mass.:58681.14
Organism:Homo sapiens (Human)
Description:calcineurin 0 HUMAN::Q08209
Residue:521
BDBM50079781
NameBDBM50079781
Synonyms:12-(2-{4-[2-(3,4-Difluoro-phenyl)-2-hydroxy-ethoxy]-3-methoxy-cyclohexyl}-1-methyl-vinyl)-17-ethyl-1,14-dihydroxy-23,25-dimethoxy-13,19,21,27-tetramethyl-11,28-dioxa-4-aza-tricyclo[22.3.1.0*4,9*]octacos-18-ene-2,3,10,16-tetraone | CHEMBL431368
TypeSmall organic molecule
Emp. Form.C51H75F2NO13
Mol. Mass.948.1369
SMILESCC[C@@H]1\C=C(C)\C[C@H](C)C[C@H](OC)[C@H]2O[C@](O)([C@H](C)C[C@@H]2OC)C(=O)C(=O)N2CCCC[C@H]2C(=O)O[C@@H]([C@H](C)[C@H](O)CC1=O)C(\C)=C\C1CC[C@@H](OC[C@H](O)c2ccc(F)c(F)c2)[C@@H](C1)OC