Reaction Details
TargetProtein phosphatase 3 catalytic subunit alpha
LigandBDBM50079784
Substrate/Competitorn/a
Meas. Tech.ChEBML_42586
IC50 4±n/a nM
Citation Armstrong, HMWong, FHolmes, MASinclair, PJGoulet, MTDumont, FJStaruch, MJKoprak, SPeterson, LBRosa, RWilusz, MBWiederrecht, GJCryan, JGWyvratt, MJParsons, WH Potent immunosuppressive C32-O-arylethyl ether derivatives of ascomycin with reduced toxicity. Bioorg Med Chem Lett9:2089-94 (1999) Protein phosphatase 3 catalytic subunit alpha
Name:Protein phosphatase 3 catalytic subunit alpha
Type:Enzyme Catalytic Domain
Mol. Mass.:58681.14
Organism:Homo sapiens (Human)
Description:calcineurin 0 HUMAN::Q08209
Residue:521
BDBM50079784
NameBDBM50079784
Synonyms:12-{2-[4-(2-Benzo[b]thiophen-2-yl-2-hydroxy-ethoxy)-3-methoxy-cyclohexyl]-1-methyl-vinyl}-17-ethyl-1,14-dihydroxy-23,25-dimethoxy-13,19,21,27-tetramethyl-11,28-dioxa-4-aza-tricyclo[22.3.1.0*4,9*]octacos-18-ene-2,3,10,16-tetraone | CHEMBL266705
TypeSmall organic molecule
Emp. Form.C53H77NO13S
Mol. Mass.968.242
SMILESCC[C@@H]1\C=C(C)\C[C@H](C)C[C@H](OC)[C@H]2O[C@](O)([C@H](C)C[C@@H]2OC)C(=O)C(=O)N2CCCC[C@H]2C(=O)O[C@@H]([C@H](C)[C@H](O)CC1=O)C(\C)=C\C1CC[C@@H](OC[C@@H](O)c2cc3ccccc3s2)[C@@H](C1)OC