Reaction Details
TargetAromatase
LigandBDBM50079816
Substrate/Competitorn/a
Meas. Tech.ChEBML_36051
IC50 880.0±n/a nM
Citation Vinh, TKAhmadi, MDelgado, POPerez, SFWalters, HMSmith, HJNicholls, PJSimons, C 1-[(Benzofuran-2-yl)phenylmethyl]-triazoles and -tetrazoles - potent competitive inhibitors of aromatase. Bioorg Med Chem Lett9:2105-8 (1999) Aromatase
Name:Aromatase
Type:Enzyme
Mol. Mass.:57888.92
Organism:Homo sapiens (Human)
Description:P11511
Residue:503
BDBM50079816
NameBDBM50079816
Synonyms:1-[(2,4-Dichloro-phenyl)-(2,3-dihydro-benzofuran-2-yl)-methyl]-1H-[1,2,4]triazole | CHEMBL304788
TypeSmall organic molecule
Emp. Form.C17H13Cl2N3O
Mol. Mass.346.211
SMILESClc1ccc(C(C2Cc3ccccc3O2)n2cncn2)c(Cl)c1