Reaction Details
TargetH2-K region expressed gene 2, rat orthologue
LigandBDBM50079822
Substrate/Competitorn/a
Meas. Tech.ChEBML_103872
IC50 88000±n/a nM
Citation Jones, ABActon, JJRivetna, MNCummings, RTCubbon, RMNichols, EASchwartz, CDWicker, LSHermes, JD Tetrapeptide derived inhibitors of complexation of a class II MHC: the peptide backbone is not inviolate. Bioorg Med Chem Lett9:2109-14 (1999) H2-K region expressed gene 2, rat orthologue
Name:H2-K region expressed gene 2, rat orthologue
Type:PROTEIN
Mol. Mass.:14499.39
Organism:Rattus norvegicus
Description:ChEMBL_10342
Residue:127
BDBM50079822
NameBDBM50079822
Synonyms:CHEMBL303059 | [(S)-1-((S)-1-{(S)-1-[((S)-1-Carbamoyl-3-methyl-butyl)-methyl-carbamoyl]-ethylcarbamoyl}-ethylcarbamoyl)-2-phenyl-ethyl]-carbamic acid ethyl ester
TypeSmall organic molecule
Emp. Form.C25H39N5O6
Mol. Mass.505.6071
SMILESCCOC(=O)N[C@@H](Cc1ccccc1)C(=O)N[C@@H](C)C(=O)N[C@@H](C)C(=O)N(C)[C@@H](CC(C)C)C(N)=O