Reaction Details
TargetH2-K region expressed gene 2, rat orthologue
LigandBDBM50079826
Substrate/Competitorn/a
Meas. Tech.ChEBML_103872
IC50 260±n/a nM
Citation Jones, ABActon, JJRivetna, MNCummings, RTCubbon, RMNichols, EASchwartz, CDWicker, LSHermes, JD Tetrapeptide derived inhibitors of complexation of a class II MHC: the peptide backbone is not inviolate. Bioorg Med Chem Lett9:2109-14 (1999) H2-K region expressed gene 2, rat orthologue
Name:H2-K region expressed gene 2, rat orthologue
Type:PROTEIN
Mol. Mass.:14499.39
Organism:Rattus norvegicus
Description:ChEMBL_10342
Residue:127
BDBM50079826
NameBDBM50079826
Synonyms:(S)-2-{(S)-2-[2-(3-Cyclohexyl-propylamino)-2-methyl-propionylamino]-pentanoylamino}-4-methyl-pentanoic acid amide | CHEMBL64939
TypeSmall organic molecule
Emp. Form.C24H46N4O3
Mol. Mass.438.647
SMILESCCC[C@H](NC(=O)C(C)(C)NCCCC1CCCCC1)C(=O)N[C@@H](CC(C)C)C(N)=O