Reaction Details
TargetH2-K region expressed gene 2, rat orthologue
LigandBDBM50079829
Substrate/Competitorn/a
Meas. Tech.ChEBML_103872
IC50 1±n/a nM
Citation Jones, ABActon, JJRivetna, MNCummings, RTCubbon, RMNichols, EASchwartz, CDWicker, LSHermes, JD Tetrapeptide derived inhibitors of complexation of a class II MHC: the peptide backbone is not inviolate. Bioorg Med Chem Lett9:2109-14 (1999) H2-K region expressed gene 2, rat orthologue
Name:H2-K region expressed gene 2, rat orthologue
Type:PROTEIN
Mol. Mass.:14499.39
Organism:Rattus norvegicus
Description:ChEMBL_10342
Residue:127
BDBM50079829
NameBDBM50079829
Synonyms:((S)-1-{(S)-1-[(S)-1-((S)-1-Carbamoyl-3-methyl-butylcarbamoyl)-butylcarbamoyl]-2-methyl-propylcarbamoyl}-2-phenyl-ethyl)-carbamic acid ethyl ester | CHEMBL63279
TypeSmall organic molecule
Emp. Form.C28H45N5O6
Mol. Mass.547.6868
SMILESCCC[C@H](NC(=O)[C@@H](NC(=O)[C@H](Cc1ccccc1)NC(=O)OCC)C(C)C)C(=O)N[C@@H](CC(C)C)C(N)=O