Reaction Details
TargetH2-K region expressed gene 2, rat orthologue
LigandBDBM50079841
Substrate/Competitorn/a
Meas. Tech.ChEMBL_103873 (CHEMBL712990)
IC50>50000±n/a nM
Citation Jones, ABActon, JJAdams, ADYuen, WNichols, EASchwartz, CDWicker, LSHermes, JD Tetrapeptide derived inhibitors of complexation of a class II MHC: fully unnatural ligands. Bioorg Med Chem Lett9:2115-8 (1999) H2-K region expressed gene 2, rat orthologue
Name:H2-K region expressed gene 2, rat orthologue
Type:PROTEIN
Mol. Mass.:14499.39
Organism:Rattus norvegicus
Description:ChEMBL_10342
Residue:127
BDBM50079841
NameBDBM50079841
Synonyms:(R)-2-[(S)-3-(3-Cyclohexyl-propylamino)-2-oxo-3-propyl-pyrrolidin-1-yl]-pentanoic acid ((S)-1-carbamoyl-3-methyl-butyl)-amide | CHEMBL413770
TypeSmall organic molecule
Emp. Form.C27H50N4O3
Mol. Mass.478.7109
SMILESCCC[C@@H](N1CC[C@](CCC)(NCCCC2CCCCC2)C1=O)C(=O)N[C@@H](CC(C)C)C(N)=O