Reaction Details
TargetReceptor-type tyrosine-protein phosphatase beta
LigandBDBM50079855
Substrate/Competitorn/a
Meas. Tech.ChEMBL_162607 (CHEMBL771319)
IC50 500±n/a nM
Citation Wrobel, JSredy, JMoxham, CDietrich, ALi, ZSawicki, DRSeestaller, LWu, LKatz, ASullivan, DTio, CZhang, ZY PTP1B inhibition and antihyperglycemic activity in the ob/ob mouse model of novel 11-arylbenzo[b]naphtho[2,3-d]furans and 11-arylbenzo[b]naphtho[2,3-d]thiophenes. J Med Chem42:3199-202 (1999) 
 
Receptor-type tyrosine-protein phosphatase beta
Name:Receptor-type tyrosine-protein phosphatase beta
Type:Protein
Mol. Mass.:224324.80
Organism:Homo sapiens (Human)
Description:P23467
Residue:1997
BDBM50079855
NameBDBM50079855
Synonyms:(R)-2-[2,6-Dibromo-4-(6-bromo-benzo[b]naphtho[2,3-d]furan-11-yl)-phenoxy]-3-phenyl-propionic acid | CHEMBL324232
TypeSmall organic molecule
Emp. Form.C31H19Br3O4
Mol. Mass.695.192
SMILESOC(=O)[C@@H](Cc1ccccc1)Oc1c(Br)cc(cc1Br)-c1c2c3ccccc3oc2c(Br)c2ccccc12