Reaction Details
TargetD(2) dopamine receptor
LigandBDBM50079948
Substrate/Competitorn/a
Meas. Tech.ChEMBL_58770 (CHEMBL669158)
Ki 113±n/a nM
Citation Birch, AMBradley, PAGill, JCKerrigan, FNeedham, PL N-Substituted (2,3-dihydro-1,4-benzodioxin-2-yl)methylamine derivatives as D(2) antagonists/5-HT(1A) partial agonists with potential as atypical antipsychotic agents. J Med Chem42:3342-55 (1999) 
 
D(2) dopamine receptor
Name:D(2) dopamine receptor
Type:G Protein-Coupled Receptor (GPCR)
Mol. Mass.:50931.60
Organism:Rattus norvegicus (rat)
Description:P61169
Residue:444
BDBM50079948
NameBDBM50079948
Synonyms:(3-Methyl-2,3-dihydro-benzo[1,4]dioxin-2-ylmethyl)-(1-pyrimidin-2-yl-piperidin-4-ylmethyl)-amine | CHEMBL419397
TypeSmall organic molecule
Emp. Form.C20H26N4O2
Mol. Mass.354.446
SMILESCC1Oc2ccccc2OC1CNCC1CCN(CC1)c1ncccn1