Reaction Details
TargetD(2) dopamine receptor
LigandBDBM50079943
Substrate/Competitorn/a
Meas. Tech.ChEMBL_58770 (CHEMBL669158)
Ki 39±n/a nM
Citation Birch, AMBradley, PAGill, JCKerrigan, FNeedham, PL N-Substituted (2,3-dihydro-1,4-benzodioxin-2-yl)methylamine derivatives as D(2) antagonists/5-HT(1A) partial agonists with potential as atypical antipsychotic agents. J Med Chem42:3342-55 (1999) 
 
D(2) dopamine receptor
Name:D(2) dopamine receptor
Type:G Protein-Coupled Receptor (GPCR)
Mol. Mass.:50931.60
Organism:Rattus norvegicus (rat)
Description:P61169
Residue:444
BDBM50079943
NameBDBM50079943
Synonyms:(2,3-Dihydro-benzo[1,4]dioxin-2-ylmethyl)-(1-phenyl-piperidin-4-ylmethyl)-amine | CHEMBL112033
TypeSmall organic molecule
Emp. Form.C21H26N2O2
Mol. Mass.338.4433
SMILESC(NCC1COc2ccccc2O1)C1CCN(CC1)c1ccccc1