Reaction Details
TargetGlutamate receptor ionotropic, NMDA 1/2A
LigandBDBM4306
Substrate/Competitorn/a
Meas. Tech.ChEMBL_141020 (CHEMBL747509)
IC50>100000±n/a nM
Citation Tamiz, APCai, SXZhou, ZLYuen, PWSchelkun, RMWhittemore, ERWeber, EWoodward, RMKeana, JF Structure-activity relationship of N-(phenylalkyl)cinnamides as novel NR2B subtype-selective NMDA receptor antagonists. J Med Chem42:3412-20 (1999) 
 
Glutamate receptor ionotropic, NMDA 1/2A
Name:Glutamate receptor ionotropic, NMDA 1/2A
Type:n/a
Mol. Mass.:n/a
Description:ASSAY_ID of EBI is 141020
Components:This complex has 2 components.
Component 1
Name:Glutamate receptor ionotropic, NMDA 2A
Synonyms:Glutamate NMDA receptor; Grin1/Grin2a Grin2a NMDE1_RAT
Type:Protein
Mol. Mass.:165478.25
Organism:Rattus norvegicus (Rat)
Description:Q00959
Residue:1464
Component 2
Name:Glutamate receptor ionotropic, NMDA 1
Synonyms:Glutamate (NMDA) receptor subunit zeta 1 Glutamate-NMDA-Channel Glutamate-NMDA-Polyamine NMDA Nmdar1 | phencyclidine
Type:Enzyme Catalytic Domain
Mol. Mass.:105533.40
Organism:RAT
Description:P35439
Residue:938
BDBM4306
NameBDBM4306
Synonyms:(2E)-2-cyano-3-(3,4-dihydroxyphenyl)-N-(2-phenylethyl)prop-2-enamide Tyrphostin deriv. 52
TypeSmall organic molecule
Emp. Form.C18H16N2O3
Mol. Mass.308.3312
SMILESOc1ccc(\C=C(/C#N)C(=O)NCCc2ccccc2)cc1O