Reaction Details
TargetCannabinoid receptor 1
LigandBDBM50067734
Substrate/Competitorn/a
Meas. Tech.ChEMBL_46804 (CHEMBL659691)
Ki 703±n/a nM
Citation Khanolkar, ADLu, DFan, PTian, XMakriyannis, A Novel conformationally restricted tetracyclic analogs of delta8-tetrahydrocannabinol. Bioorg Med Chem Lett9:2119-24 (1999) Cannabinoid receptor 1
Name:Cannabinoid receptor 1
Type:G Protein-Coupled Receptor (GPCR)
Mol. Mass.:52856.55
Organism:Rattus norvegicus (rat)
Description:P20272
Residue:473
BDBM50067734
NameBDBM50067734
Synonyms:(-)-(6aR-trans)-6,6,9-trimethyl-3-pentyl-6a,7,10,10a-tetrahydro-6H-benzo[c]chromen-1-ol (6aR,10aR)-6,6,9-Trimethyl-3-pentyl-6a,7,10,10a-tetrahydro-6H-benzo[c]chromen-1-ol CHEMBL267227 | delta 8-tetrahydrocannobinol
TypeSmall organic molecule
Emp. Form.C21H30O2
Mol. Mass.314.4617
SMILESCCCCCc1cc(O)c2[C@@H]3CC(C)=CC[C@H]3C(C)(C)Oc2c1