Reaction Details
TargetVoltage-dependent N-type calcium channel subunit alpha-1B
LigandBDBM50080037
Substrate/Competitorn/a
Meas. Tech.ChEMBL_141439 (CHEMBL751984)
IC50 36±n/a nM
Citation Hu, LYRyder, TRRafferty, MFDooley, DJGeer, JJLotarski, SMMiljanich, GPMillerman, ERock, DMStoehr, SJSzoke, BGTaylor, CPVartanian, MG Structure-activity relationship of N-methyl-N-aralkyl-peptidylamines as novel N-type calcium channel blockers. Bioorg Med Chem Lett9:2151-6 (1999) Voltage-dependent N-type calcium channel subunit alpha-1B
Name:Voltage-dependent N-type calcium channel subunit alpha-1B
Type:Enzyme
Mol. Mass.:262548.16
Organism:Homo sapiens (Human)
Description:Q00975
Residue:2339
BDBM50080037
NameBDBM50080037
Synonyms:Benzoic acid 4-((S)-2-{(S)-2-[(4-tert-butyl-benzyl)-methyl-amino]-4-methyl-pentanoylamino}-2-tert-butylcarbamoyl-ethyl)-phenyl ester | CHEMBL304309
TypeSmall organic molecule
Emp. Form.C38H51N3O4
Mol. Mass.613.8292
SMILESCC(C)C[C@H](N(C)Cc1ccc(cc1)C(C)(C)C)C(=O)N[C@@H](Cc1ccc(OC(=O)c2ccccc2)cc1)C(=O)NC(C)(C)C