Reaction Details
TargetAdenosine receptor A1
LigandBDBM50080287
Substrate/Competitorn/a
Meas. Tech.ChEMBL_27911 (CHEMBL642159)
Ki 144±n/a nM
Citation Campbell, RMCartwright, CChen, WChen, YDuzic, EFu, JMLoveland, MManning, RMcKibben, BPleiman, CMSilverman, LTrueheart, JWebb, DRWilkinson, VWitter, DJXie, XCastelhano, AL Selective A1-adenosine receptor antagonists identified using yeast Saccharomyces cerevisiae functional assays. Bioorg Med Chem Lett9:2413-8 (1999) Adenosine receptor A1
Name:Adenosine receptor A1
Type:G Protein-Coupled Receptor (GPCR)
Mol. Mass.:36520.92
Organism:Homo sapiens (Human)
Description:P30542
Residue:326
BDBM50080287
NameBDBM50080287
Synonyms:1-[2-(5,6-Dimethyl-2-phenyl-7H-pyrrolo[2,3-d]pyrimidin-4-ylamino)-ethyl]-imidazolidin-2-one | CHEMBL82197
TypeSmall organic molecule
Emp. Form.C19H22N6O
Mol. Mass.350.4176
SMILESCc1[nH]c2nc(nc(NCCN3CCNC3=O)c2c1C)-c1ccccc1