Reaction Details
TargetFolylpolyglutamate synthase, mitochondrial
LigandBDBM50080449
Substrate/Competitorn/a
Meas. Tech.ChEMBL_68520 (CHEMBL676944)
Ki 110000±n/a nM
Citation Rosowsky, AForsch, RANull, AMoran, RG 5-deazafolate analogues with a rotationally restricted glutamate or ornithine side chain: synthesis and binding interaction with folylpolyglutamate synthetase. J Med Chem42:3510-9 (1999) 
 
Folylpolyglutamate synthase, mitochondrial
Name:Folylpolyglutamate synthase, mitochondrial
Type:PROTEIN
Mol. Mass.:64621.95
Organism:Homo sapiens (Human)
Description:ChEMBL_68676
Residue:587
BDBM50080449
NameBDBM50080449
Synonyms:(S)-5-Amino-2-{5-[(2-amino-4-oxo-3,4-dihydro-pyrido[2,3-d]pyrimidin-6-ylmethyl)-amino]-1-oxo-1,3-dihydro-isoindol-2-yl}-pentanoic acid | CHEMBL117462
TypeSmall organic molecule
Emp. Form.C21H23N7O4
Mol. Mass.437.4518
SMILESNCCC[C@H](N1Cc2cc(NCc3cnc4nc(N)[nH]c(=O)c4c3)ccc2C1=O)C(O)=O