Reaction Details
TargetDelta-type opioid receptor
LigandBDBM50001157
Substrate/Competitorn/a
Meas. Tech.ChEMBL_146907 (CHEMBL751120)
Ki 0.12±n/a nM
Citation Schiller, PWFundytus, MEMerovitz, LWeltrowska, GNguyen, TMLemieux, CChung, NNCoderre, TJ The opioid mu agonist/delta antagonist DIPP-NH(2)[Psi] produces a potent analgesic effect, no physical dependence, and less tolerance than morphine in rats. J Med Chem42:3520-6 (1999) 
 
Delta-type opioid receptor
Name:Delta-type opioid receptor
Type:G Protein-Coupled Receptor (GPCR)
Mol. Mass.:40465.04
Organism:Rattus norvegicus (rat)
Description:Competition binding assays were using CHO-K1 cell membranes expressing the opioid receptor.
Residue:372
BDBM50001157
NameBDBM50001157
Synonyms:CHEMBL538700
TypeSmall organic molecule
Emp. Form.C39H43N5O5
Mol. Mass.661.7892
SMILESCc1cc(O)cc(C)c1C[C@H](N)C(=O)N1Cc2ccccc2C[C@H]1C(=O)N[C@@H](Cc1ccccc1)C(=O)N[C@@H](Cc1ccccc1)C(N)=O