Reaction Details
TargetDelta-type opioid receptor
LigandBDBM50080453
Substrate/Competitorn/a
Meas. Tech.ChEMBL_146907 (CHEMBL751120)
Ki 0.45±n/a nM
Citation Schiller, PWFundytus, MEMerovitz, LWeltrowska, GNguyen, TMLemieux, CChung, NNCoderre, TJ The opioid mu agonist/delta antagonist DIPP-NH(2)[Psi] produces a potent analgesic effect, no physical dependence, and less tolerance than morphine in rats. J Med Chem42:3520-6 (1999) 
 
Delta-type opioid receptor
Name:Delta-type opioid receptor
Type:G Protein-Coupled Receptor (GPCR)
Mol. Mass.:40465.04
Organism:Rattus norvegicus (rat)
Description:Competition binding assays were using CHO-K1 cell membranes expressing the opioid receptor.
Residue:372
BDBM50080453
NameBDBM50080453
Synonyms:(S)-2-({2-[(S)-2-Amino-3-(4-hydroxy-2,6-dimethyl-phenyl)-propionyl]-1,2,3,4-tetrahydro-isoquinolin-3-ylmethyl}-amino)-N-((S)-1-carbamoyl-2-phenyl-ethyl)-3-phenyl-propionamide | CHEMBL119590
TypeSmall organic molecule
Emp. Form.C39H45N5O4
Mol. Mass.647.8057
SMILESCc1cc(O)cc(C)c1C[C@H](N)C(=O)N1Cc2ccccc2CC1CN[C@@H](Cc1ccccc1)C(=O)N[C@@H](Cc1ccccc1)C(N)=O