Reaction Details
TargetEndothelin-1 receptor
LigandBDBM50051007
Substrate/Competitorn/a
Meas. Tech.ChEMBL_65475 (CHEMBL677305)
IC50 0.08±n/a nM
Citation von Geldern, TWTasker, ASSorensen, BKWinn, MSzczepankiewicz, BGDixon, DBChiou, WJWang, LWessale, JLAdler, AMarsh, KCNguyen, BOpgenorth, TJ Pyrrolidine-3-carboxylic acids as endothelin antagonists. 4. Side chain conformational restriction leads to ET(B) selectivity. J Med Chem42:3668-78 (1999) 
 
Endothelin-1 receptor
Name:Endothelin-1 receptor
Type:Enzyme Catalytic Domain
Mol. Mass.:48736.88
Organism:Homo sapiens (Human)
Description:P25101
Residue:427
BDBM50051007
NameBDBM50051007
Synonyms:(2R,3R,4S)-4-Benzo[1,3]dioxol-5-yl-1-dibutylcarbamoylmethyl-2-(4-methoxy-phenyl)-pyrrolidine-3-carboxylic acid A-127722 | CHEMBL9194
TypeSmall organic molecule
Emp. Form.C29H38N2O6
Mol. Mass.510.6218
SMILESCCCCN(CCCC)C(=O)CN1C[C@@H]([C@H]([C@@H]1c1ccc(OC)cc1)C(O)=O)c1ccc2OCOc2c1