Reaction Details
TargetEndothelin receptor type B
LigandBDBM50080589
Substrate/Competitorn/a
Meas. Tech.ChEMBL_63675 (CHEMBL670478)
IC50 0.8±n/a nM
Citation von Geldern, TWTasker, ASSorensen, BKWinn, MSzczepankiewicz, BGDixon, DBChiou, WJWang, LWessale, JLAdler, AMarsh, KCNguyen, BOpgenorth, TJ Pyrrolidine-3-carboxylic acids as endothelin antagonists. 4. Side chain conformational restriction leads to ET(B) selectivity. J Med Chem42:3668-78 (1999) 
 
Endothelin receptor type B
Name:Endothelin receptor type B
Type:Enzyme Catalytic Domain
Mol. Mass.:49664.00
Organism:Homo sapiens (Human)
Description:ENDOTHELIN B EDNRB HUMAN::P24530
Residue:442
BDBM50080589
NameBDBM50080589
Synonyms:(2R,3R,4S)-4-Benzo[1,3]dioxol-5-yl-1-[(2,6-diethyl-4-fluoro-phenylcarbamoyl)-methyl]-2-(4-methoxy-phenyl)-pyrrolidine-3-carboxylic acid | CHEMBL333972
TypeSmall organic molecule
Emp. Form.C31H33FN2O6
Mol. Mass.548.6019
SMILESCCc1cc(F)cc(CC)c1NC(=O)CN1C[C@@H]([C@H]([C@@H]1c1ccc(OC)cc1)C(O)=O)c1ccc2OCOc2c1