Reaction Details
TargetEndothelin-1 receptor
LigandBDBM50080629
Substrate/Competitorn/a
Meas. Tech.ChEMBL_65474 (CHEMBL677304)
IC50 1.6±n/a nM
Citation Liu, GKozmina, NSWinn, Mvon Geldern, TWChiou, WJDixon, DBNguyen, BMarsh, KCOpgenorth, TJ Design, synthesis, and activity of a series of pyrrolidine-3-carboxylic acid-based, highly specific, orally active ET(B) antagonists containing a diphenylmethylamine acetamide side chain. J Med Chem42:3679-89 (1999) 
 
Endothelin-1 receptor
Name:Endothelin-1 receptor
Type:Enzyme Catalytic Domain
Mol. Mass.:48736.88
Organism:Homo sapiens (Human)
Description:P25101
Residue:427
BDBM50080629
NameBDBM50080629
Synonyms:(2R,3R,4S)-4-Benzo[1,3]dioxol-5-yl-2-(4-methoxy-phenyl)-1-[(1-phenyl-pentylcarbamoyl)-methyl]-pyrrolidine-3-carboxylic acid; TFA | CHEMBL334076
TypeSmall organic molecule
Emp. Form.C32H36N2O6
Mol. Mass.544.638
SMILESCCCCC(NC(=O)CN1C[C@@H]([C@H]([C@@H]1c1ccc(OC)cc1)C(O)=O)c1ccc2OCOc2c1)c1ccccc1