Reaction Details
TargetProtein farnesyltransferase subunit beta/geranylgeranyltransferase type-1 subunit alpha
LigandBDBM50080742
Substrate/Competitorn/a
Meas. Tech.ChEMBL_70270 (CHEMBL681409)
IC50 0.1±n/a nM
Citation O'Connor, SJBarr, KJWang, LSorensen, BKTasker, ASSham, HNg, SCCohen, JDevine, ECherian, SSaeed, BZhang, HLee, JYWarner, RTahir, SKovar, PEwing, PAlder, JMitten, MLeal, JMarsh, KBauch, JHoffman, DJSebti, SMRosenberg, SH Second-generation peptidomimetic inhibitors of protein farnesyltransferase demonstrating improved cellular potency and significant in vivo efficacy. J Med Chem42:3701-10 (1999) 
 
Protein farnesyltransferase subunit beta/geranylgeranyltransferase type-1 subunit alpha
Name:Protein farnesyltransferase subunit beta/geranylgeranyltransferase type-1 subunit alpha
Type:Protein Complex
Mol. Mass.:n/a
Description:Purified bovine brain FTase.
Components:This complex has 2 components.
Component 1
Name:Protein farnesyltransferase/geranylgeranyltransferase type-1 subunit alpha
Synonyms:CAAX farnesyltransferase alpha subunit FNTA_BOVIN GGTase-I-alpha Protein Farnesyltransferase (PFT) Chain A Protein farnesyltransferase/geranylgeranyltransferase type I alpha subunit Type I protein geranyl-geranyltransferase alpha subunit
Type:Enzyme
Mol. Mass.:43827.38
Organism:Bos taurus (bovine)
Description:The enzyme was purified from a bovine brain homogenate by sequential ammonium sulfate fractionation and affinity chromatography.
Residue:375
Component 2
Name:Protein farnesyltransferase subunit beta
Synonyms:CAAX farnesyltransferase subunit beta FNTB_BOVIN Protein farnesyltransferase Protein farnesyltransferase subunit beta Ras proteins prenyltransferase subunit beta
Type:Enzyme Subunit
Mol. Mass.:48758.49
Organism:Bos taurus (bovine)
Description:Protein farnesyltransferase subunit beta
Residue:437
BDBM50080742
NameBDBM50080742
Synonyms:(S)-2-[(5-{[Benzyl-(5-fluoro-pyridin-3-yl)-amino]-methyl}-2'-methyl-biphenyl-2-carbonyl)-amino]-4-methylsulfanyl-butyric acid | CHEMBL333575
TypeSmall organic molecule
Emp. Form.C32H32FN3O3S
Mol. Mass.557.678
SMILESCSCC[C@H](NC(=O)c1ccc(CN(Cc2ccccc2)c2cncc(F)c2)cc1-c1ccccc1C)C(O)=O