Reaction Details
TargetProtein farnesyltransferase subunit beta/geranylgeranyltransferase type-1 subunit alpha
LigandBDBM50067563
Substrate/Competitorn/a
Meas. Tech.ChEMBL_70270 (CHEMBL681409)
IC50 0.4±n/a nM
Citation O'Connor, SJBarr, KJWang, LSorensen, BKTasker, ASSham, HNg, SCCohen, JDevine, ECherian, SSaeed, BZhang, HLee, JYWarner, RTahir, SKovar, PEwing, PAlder, JMitten, MLeal, JMarsh, KBauch, JHoffman, DJSebti, SMRosenberg, SH Second-generation peptidomimetic inhibitors of protein farnesyltransferase demonstrating improved cellular potency and significant in vivo efficacy. J Med Chem42:3701-10 (1999) 
 
Protein farnesyltransferase subunit beta/geranylgeranyltransferase type-1 subunit alpha
Name:Protein farnesyltransferase subunit beta/geranylgeranyltransferase type-1 subunit alpha
Type:Protein Complex
Mol. Mass.:n/a
Description:Purified bovine brain FTase.
Components:This complex has 2 components.
Component 1
Name:Protein farnesyltransferase/geranylgeranyltransferase type-1 subunit alpha
Synonyms:CAAX farnesyltransferase alpha subunit FNTA_BOVIN GGTase-I-alpha Protein Farnesyltransferase (PFT) Chain A Protein farnesyltransferase/geranylgeranyltransferase type I alpha subunit Type I protein geranyl-geranyltransferase alpha subunit
Type:Enzyme
Mol. Mass.:43827.38
Organism:Bos taurus (bovine)
Description:The enzyme was purified from a bovine brain homogenate by sequential ammonium sulfate fractionation and affinity chromatography.
Residue:375
Component 2
Name:Protein farnesyltransferase subunit beta
Synonyms:CAAX farnesyltransferase subunit beta FNTB_BOVIN Protein farnesyltransferase Protein farnesyltransferase subunit beta Ras proteins prenyltransferase subunit beta
Type:Enzyme Subunit
Mol. Mass.:48758.49
Organism:Bos taurus (bovine)
Description:Protein farnesyltransferase subunit beta
Residue:437
BDBM50067563
NameBDBM50067563
Synonyms:(S)-2-{[2'-Methyl-5-(pyridin-3-yloxymethyl)-biphenyl-2-carbonyl]-amino}-4-methylsulfanyl-butyric acid CHEMBL274122
TypeSmall organic molecule
Emp. Form.C25H26N2O4S
Mol. Mass.450.55
SMILESCSCC[C@H](NC(=O)c1ccc(COc2cccnc2)cc1-c1ccccc1C)C(O)=O