Reaction Details
TargetD(4) dopamine receptor
LigandBDBM50080796
Substrate/Competitorn/a
Meas. Tech.ChEMBL_61154 (CHEMBL671240)
Ki 6.9±n/a nM
Citation Kesten, SRHeffner, TGJohnson, SJPugsley, TAWright, JLWise, LD Design, synthesis, and evaluation of chromen-2-ones as potent and selective human dopamine D4 antagonists. J Med Chem42:3718-25 (1999) 
 
D(4) dopamine receptor
Name:D(4) dopamine receptor
Type:Enzyme
Mol. Mass.:48373.19
Organism:Homo sapiens (Human)
Description:P21917
Residue:419
BDBM50080796
NameBDBM50080796
Synonyms:7-[4-(3-Chloro-4-methyl-phenyl)-piperazin-1-ylmethyl]-chromen-2-one | CHEMBL123031
TypeSmall organic molecule
Emp. Form.C21H21ClN2O2
Mol. Mass.368.857
SMILESCc1ccc(cc1Cl)N1CCN(Cc2ccc3ccc(=O)oc3c2)CC1