Reaction Details
TargetD(4) dopamine receptor
LigandBDBM50080788
Substrate/Competitorn/a
Meas. Tech.ChEMBL_61011 (CHEMBL675016)
Ki 16±n/a nM
Citation Kesten, SRHeffner, TGJohnson, SJPugsley, TAWright, JLWise, LD Design, synthesis, and evaluation of chromen-2-ones as potent and selective human dopamine D4 antagonists. J Med Chem42:3718-25 (1999) 
 
D(4) dopamine receptor
Name:D(4) dopamine receptor
Type:Enzyme
Mol. Mass.:48373.19
Organism:Homo sapiens (Human)
Description:P21917
Residue:419
BDBM50080788
NameBDBM50080788
Synonyms:7-(4-o-Tolyl-piperazin-1-ylmethyl)-chromen-2-one | CHEMBL333658
TypeSmall organic molecule
Emp. Form.C21H22N2O2
Mol. Mass.334.4116
SMILESCc1ccccc1N1CCN(Cc2ccc3ccc(=O)oc3c2)CC1