Reaction Details
TargetD(4) dopamine receptor
LigandBDBM50080808
Substrate/Competitorn/a
Meas. Tech.ChEMBL_61011 (CHEMBL675016)
Ki 27±n/a nM
Citation Kesten, SRHeffner, TGJohnson, SJPugsley, TAWright, JLWise, LD Design, synthesis, and evaluation of chromen-2-ones as potent and selective human dopamine D4 antagonists. J Med Chem42:3718-25 (1999) 
 
D(4) dopamine receptor
Name:D(4) dopamine receptor
Type:Enzyme
Mol. Mass.:48373.19
Organism:Homo sapiens (Human)
Description:P21917
Residue:419
BDBM50080808
NameBDBM50080808
Synonyms:7-(4-Phenyl-piperazin-1-ylmethyl)-chromen-2-one | CHEMBL122140
TypeSmall organic molecule
Emp. Form.C20H20N2O2
Mol. Mass.320.385
SMILESO=c1ccc2ccc(CN3CCN(CC3)c3ccccc3)cc2o1