Reaction Details
TargetProthrombin
LigandBDBM50080895
Substrate/Competitorn/a
Meas. Tech.ChEMBL_208354 (CHEMBL813664)
Ki 30±n/a nM
Citation Cody, WLCai, CDoherty, AMEdmunds, JJHe, JXNarasimhan, LSPlummer, JSRapundalo, STRubin, JRVan Huis, CASt-Denis, YWinocour, PDSiddiqui, MA The design of potent and selective inhibitors of thrombin utilizing a piperazinedione template: part 1. Bioorg Med Chem Lett9:2497-502 (1999) Prothrombin
Name:Prothrombin
Type:Protein
Mol. Mass.:70029.57
Organism:Homo sapiens (Human)
Description:P00734
Residue:622
BDBM50080895
NameBDBM50080895
Synonyms:CHEMBL311198 | N-[(S)-1-(1-Carbamimidoyl-piperidin-3-ylmethyl)-2-oxo-2-thiazol-2-yl-ethyl]-2-[(S)-2-naphthalen-2-ylmethyl-3,6-dioxo-4-(3-phenyl-propyl)-piperazin-1-yl]-acetamide
TypeSmall organic molecule
Emp. Form.C38H43N7O4S
Mol. Mass.693.858
SMILESNC(=N)N1CCCC(C[C@H](NC(=O)CN2[C@@H](Cc3ccc4ccccc4c3)C(=O)N(CCCc3ccccc3)CC2=O)C(=O)c2nccs2)C1