Reaction Details
TargetScytalone dehydratase
LigandBDBM50080936
Substrate/Competitorn/a
Meas. Tech.ChEBML_199521
Ki 2.30±n/a nM
Citation Jennings, LDWawrzak, ZAmorose, DSchwartz, RSJordan, DB A new potent inhibitor of fungal melanin biosynthesis identified through combinatorial chemistry. Bioorg Med Chem Lett9:2509-14 (1999) Scytalone dehydratase
Name:Scytalone dehydratase
Type:PROTEIN
Mol. Mass.:20248.63
Organism:Magnaporthe grisea
Description:ChEMBL_199536
Residue:172
BDBM50080936
NameBDBM50080936
Synonyms:3-Chloro-3-methyl-1-trifluoromethyl-cyclobutanecarboxylic acid [(R)-1-(4-bromo-phenyl)-ethyl]-amide | CHEMBL432940
TypeSmall organic molecule
Emp. Form.C15H16BrClF3NO
Mol. Mass.398.646
SMILESC[C@@H](NC(=O)C1(CC(C)(Cl)C1)C(F)(F)F)c1ccc(Br)cc1