Reaction Details
TargetD(2) dopamine receptor
LigandBDBM50081110
Substrate/Competitorn/a
Meas. Tech.ChEMBL_61465 (CHEMBL671446)
Ki 0.180000±n/a nM
Citation Mewshaw, RENelson, JAShah, USShi, XMazandarani, HCoupet, JMarquis, KBrennan, JAAndree, TH New generation dopaminergic agents. 7. Heterocyclic bioisosteres that exploit the 3-OH-phenoxyethylamine D2 template. Bioorg Med Chem Lett9:2593-8 (1999) D(2) dopamine receptor
Name:D(2) dopamine receptor
Type:G Protein-Coupled Receptor (GPCR)
Mol. Mass.:50931.60
Organism:Rattus norvegicus (rat)
Description:P61169
Residue:444
BDBM50081110
NameBDBM50081110
Synonyms:Benzyl-[2-(2-trifluoromethyl-1H-benzoimidazol-4-yloxy)-ethyl]-amine | CHEMBL87192
TypeSmall organic molecule
Emp. Form.C17H16F3N3O
Mol. Mass.335.3236
SMILESFC(F)(F)c1nc2cccc(OCCNCc3ccccc3)c2[nH]1