Reaction Details
TargetD(2) dopamine receptor
LigandBDBM50081112
Substrate/Competitorn/a
Meas. Tech.ChEMBL_61465 (CHEMBL671446)
Ki 0.180000±n/a nM
Citation Mewshaw, RENelson, JAShah, USShi, XMazandarani, HCoupet, JMarquis, KBrennan, JAAndree, TH New generation dopaminergic agents. 7. Heterocyclic bioisosteres that exploit the 3-OH-phenoxyethylamine D2 template. Bioorg Med Chem Lett9:2593-8 (1999) D(2) dopamine receptor
Name:D(2) dopamine receptor
Type:G Protein-Coupled Receptor (GPCR)
Mol. Mass.:50931.60
Organism:Rattus norvegicus (rat)
Description:P61169
Residue:444
BDBM50081112
NameBDBM50081112
Synonyms:4-(2-Benzylamino-ethoxy)-1,3-dihydro-benzoimidazol-2-one | CHEMBL314174
TypeSmall organic molecule
Emp. Form.C16H17N3O2
Mol. Mass.283.3251
SMILESO=c1[nH]c2cccc(OCCNCc3ccccc3)c2[nH]1