Reaction Details
TargetDimer of Protein farnesyltransferase subunit beta
LigandBDBM50081214
Substrate/Competitorn/a
Meas. Tech.ChEMBL_70303 (CHEMBL677850)
IC50 1±n/a nM
Citation Williams, TMBergman, JMBrashear, KBreslin, MJDinsmore, CJHutchinson, JHMacTough, SCStump, CAWei, DDZartman, CBBogusky, MJCulberson, JCBuser-Doepner, CDavide, JGreenberg, IBHamilton, KAKoblan, KSKohl, NELiu, DLobell, RBMosser, SDO'Neill, TJRands, ESchaber, MDHuff, JR N-arylpiperazinone inhibitors of farnesyltransferase: discovery and biological activity. J Med Chem42:3779-84 (1999) Dimer of Protein farnesyltransferase subunit beta
Name:Dimer of Protein farnesyltransferase subunit beta
Synonyms:Protein Farnesyltransferase (PFT) Chain B
Type:n/a
Mol. Mass.:n/a
Description:ASSAY_ID of EBI is 51428
Components:This complex has 3 components.
Component 1
Name:Protein farnesyltransferase subunit beta
Type:Enzyme Subunit
Mol. Mass.:48766.02
Organism:Homo sapiens (Human)
Description:Protein farnesyltransferase subunit beta
Residue:437
Component 2
Name:Protein farnesyltransferase subunit beta
Synonyms:CAAX farnesyltransferase subunit alpha FNTB FTase-alpha GGTase-I-alpha Protein farnesyl/geranylgeranyl transferase Protein farnesyltransferase subunit beta Protein farnesyltransferase/geranylgeranyltransferase type-1 subunit alpha Ras proteins prenyltransferase subunit beta | Type I protein geranyl-geranyltransferase subunit alpha
Type:Enzyme Subunit
Mol. Mass.:48766.02
Organism:Homo sapiens (Human)
Description:Protein farnesyltransferase subunit beta
Residue:437
BDBM50081214
NameBDBM50081214
Synonyms:CHEMBL340493 | [(S)-4-((S)-2-Amino-2-mercapto-ethyl)-3-butyl-piperazin-1-yl]-naphthalen-1-yl-methanone
TypeSmall organic molecule
Emp. Form.C21H29N3OS
Mol. Mass.371.539
SMILESCCCC[C@H]1CN(CCN1C[C@@H](N)S)C(=O)c1cccc2ccccc12