Reaction Details
TargetPeroxisome proliferator-activated receptor delta
LigandBDBM50081222
Substrate/Competitorn/a
Meas. Tech.ChEMBL_154039 (CHEMBL757754)
EC50 1400±n/a nM
Citation Brown, PJWinegar, DAPlunket, KDMoore, LBLewis, MCWilson, JGSundseth, SSKoble, CSWu, ZChapman, JMLehmann, JMKliewer, SAWillson, TM A ureido-thioisobutyric acid (GW9578) is a subtype-selective PPARalpha agonist with potent lipid-lowering activity. J Med Chem42:3785-8 (1999) Peroxisome proliferator-activated receptor delta
Name:Peroxisome proliferator-activated receptor delta
Type:PROTEIN
Mol. Mass.:49719.14
Organism:Mus musculus
Description:ChEMBL_1288931
Residue:440
BDBM50081222
NameBDBM50081222
Synonyms:2-(4-{2-[1-Cycloheptyl-3-(2,4-difluoro-phenyl)-ureido]-ethyl}-phenoxy)-2-methyl-propionic acid | CHEMBL124079
TypeSmall organic molecule
Emp. Form.C26H32F2N2O4
Mol. Mass.474.5401
SMILESCC(C)(Oc1ccc(CCN(C2CCCCCC2)C(=O)Nc2ccc(F)cc2F)cc1)C(O)=O