Reaction Details
TargetPeroxisome proliferator-activated receptor gamma
LigandBDBM50081223
Substrate/Competitorn/a
Meas. Tech.ChEMBL_154533 (CHEMBL760254)
EC50 400±n/a nM
Citation Brown, PJWinegar, DAPlunket, KDMoore, LBLewis, MCWilson, JGSundseth, SSKoble, CSWu, ZChapman, JMLehmann, JMKliewer, SAWillson, TM A ureido-thioisobutyric acid (GW9578) is a subtype-selective PPARalpha agonist with potent lipid-lowering activity. J Med Chem42:3785-8 (1999) Peroxisome proliferator-activated receptor gamma
Name:Peroxisome proliferator-activated receptor gamma
Type:PROTEIN
Mol. Mass.:57593.55
Organism:Mus musculus
Description:ChEMBL_1453700
Residue:505
BDBM50081223
NameBDBM50081223
Synonyms:2-(4-{2-[3-(2,4-Difluoro-phenyl)-1-heptyl-ureido]-ethyl}-phenoxy)-2-methyl-propionic acid | CHEMBL124842
TypeSmall organic molecule
Emp. Form.C26H34F2N2O4
Mol. Mass.476.556
SMILESCCCCCCCN(CCc1ccc(OC(C)(C)C(O)=O)cc1)C(=O)Nc1ccc(F)cc1F