Reaction Details
TargetPeroxisome proliferator-activated receptor alpha
LigandBDBM50081225
Substrate/Competitorn/a
Meas. Tech.ChEMBL_153707 (CHEMBL759333)
EC50 33±n/a nM
Citation Brown, PJWinegar, DAPlunket, KDMoore, LBLewis, MCWilson, JGSundseth, SSKoble, CSWu, ZChapman, JMLehmann, JMKliewer, SAWillson, TM A ureido-thioisobutyric acid (GW9578) is a subtype-selective PPARalpha agonist with potent lipid-lowering activity. J Med Chem42:3785-8 (1999) Peroxisome proliferator-activated receptor alpha
Name:Peroxisome proliferator-activated receptor alpha
Type:PROTEIN
Mol. Mass.:52343.28
Organism:Mus musculus
Description:ChEMBL_572395
Residue:468
BDBM50081225
NameBDBM50081225
Synonyms:2-(4-{2-[3-(4-Fluoro-phenyl)-1-heptyl-ureido]-ethyl}-phenoxy)-2-methyl-propionic acid | CHEMBL340011
TypeSmall organic molecule
Emp. Form.C26H35FN2O4
Mol. Mass.458.5655
SMILESCCCCCCCN(CCc1ccc(OC(C)(C)C(O)=O)cc1)C(=O)Nc1ccc(F)cc1