Reaction Details
TargetPeroxisome proliferator-activated receptor gamma
LigandBDBM28700
Substrate/Competitorn/a
Meas. Tech.ChEMBL_154055 (CHEMBL761026)
EC50 300000±n/a nM
Citation Brown, PJWinegar, DAPlunket, KDMoore, LBLewis, MCWilson, JGSundseth, SSKoble, CSWu, ZChapman, JMLehmann, JMKliewer, SAWillson, TM A ureido-thioisobutyric acid (GW9578) is a subtype-selective PPARalpha agonist with potent lipid-lowering activity. J Med Chem42:3785-8 (1999) Peroxisome proliferator-activated receptor gamma
Name:Peroxisome proliferator-activated receptor gamma
Type:Nuclear Receptor
Mol. Mass.:57613.46
Organism:Homo sapiens (Human)
Description:P37231
Residue:505
BDBM28700
NameBDBM28700
Synonyms:2-(4-(4-Chlorobenzoyl)phenoxy)-2-methylpropionic acid CHEMBL981 FIBRICOR LF 153 procetofenic acid
TypeSmall organic molecule
Emp. Form.C17H15ClO4
Mol. Mass.318.752
SMILESCC(C)(Oc1ccc(cc1)C(=O)c1ccc(Cl)cc1)C(O)=O