Reaction Details
TargetPeroxisome proliferator-activated receptor alpha
LigandBDBM28699
Substrate/Competitorn/a
Meas. Tech.ChEMBL_153707 (CHEMBL759333)
EC50 50000±n/a nM
Citation Brown, PJWinegar, DAPlunket, KDMoore, LBLewis, MCWilson, JGSundseth, SSKoble, CSWu, ZChapman, JMLehmann, JMKliewer, SAWillson, TM A ureido-thioisobutyric acid (GW9578) is a subtype-selective PPARalpha agonist with potent lipid-lowering activity. J Med Chem42:3785-8 (1999) Peroxisome proliferator-activated receptor alpha
Name:Peroxisome proliferator-activated receptor alpha
Type:PROTEIN
Mol. Mass.:52343.28
Organism:Mus musculus
Description:ChEMBL_572395
Residue:468
BDBM28699
NameBDBM28699
Synonyms:2-(4-chlorophenoxy)-2-methylpropanoic acid Clofibrate clofibric acid
TypeSmall organic molecule
Emp. Form.C10H11ClO3
Mol. Mass.214.646
SMILESCC(C)(Oc1ccc(Cl)cc1)C(O)=O