Reaction Details
TargetrRNA adenine N-6-methyltransferase
LigandBDBM50081276
Substrate/Competitorn/a
Meas. Tech.ChEMBL_67531 (CHEMBL679968)
Ki 12500±n/a nM
Citation Hajduk, PJDinges, JSchkeryantz, JMJanowick, DKaminski, MTufano, MAugeri, DJPetros, ANienaber, VZhong, PHammond, RCoen, MBeutel, BKatz, LFesik, SW Novel inhibitors of Erm methyltransferases from NMR and parallel synthesis. J Med Chem42:3852-9 (1999) rRNA adenine N-6-methyltransferase
Name:rRNA adenine N-6-methyltransferase
Type:PROTEIN
Mol. Mass.:28804.82
Organism:Streptococcus pneumoniae
Description:ChEMBL_67532
Residue:245
BDBM50081276
NameBDBM50081276
Synonyms:CHEMBL330769 | {1-[4-Amino-6-(indan-2-ylamino)-[1,3,5]triazin-2-yl]-piperidin-3-yl}-methanol
TypeSmall organic molecule
Emp. Form.C18H24N6O
Mol. Mass.340.4228
SMILESNc1nc(NC2Cc3ccccc3C2)nc(n1)N1CCCC(CO)C1