Reaction Details
TargetrRNA adenine N-6-methyltransferase
LigandBDBM50081281
Substrate/Competitorn/a
Meas. Tech.ChEMBL_67531 (CHEMBL679968)
Ki>75000±n/a nM
Citation Hajduk, PJDinges, JSchkeryantz, JMJanowick, DKaminski, MTufano, MAugeri, DJPetros, ANienaber, VZhong, PHammond, RCoen, MBeutel, BKatz, LFesik, SW Novel inhibitors of Erm methyltransferases from NMR and parallel synthesis. J Med Chem42:3852-9 (1999) rRNA adenine N-6-methyltransferase
Name:rRNA adenine N-6-methyltransferase
Type:PROTEIN
Mol. Mass.:28804.82
Organism:Streptococcus pneumoniae
Description:ChEMBL_67532
Residue:245
BDBM50081281
NameBDBM50081281
Synonyms:CHEMBL124520 | Indan-2-yl-(4-piperidin-1-yl-[1,3,5]triazin-2-yl)-amine
TypeSmall organic molecule
Emp. Form.C17H21N5
Mol. Mass.295.3821
SMILESC1C(Cc2ccccc12)Nc1ncnc(n1)N1CCCCC1